Actualités

Arduino: 1.8.13 (Windows 10), Board: "Arduino Uno" avr-gcc: error: @C:\Windows\TEMP\cceNc5Ku: Invalid argument avr-gcc: fatal error: no input files compilation terminated. lto-wrapper.exe: fatal error ...
I would like to install StandardFirmataPlus firmware on my Arduino Nano Every (ATMEGA4809) but it fails with some errors which are unknown to me. If I click "Verify" or "Upload" I get this error: M ...
[psgarcha] took a year-old Arduino Uno on an international trip and upon returning found something was wrong. Every time he would try to upload, he would get the dreaded avrdude error, ‘stk500 ...